Target
Histone-lysine N-methyltransferase EZH1
Ligand
BDBM50205626
Substrate
Meas. Tech.
ChEMBL_1628507 (CHEMBL3871092)
IC50
1980±n/a nM
Citation
 Ansari, ASatalkar, SPatil, VShete, ASKaur, SGupta, ASingh, SRaja, MSeverance, DLBernales, SChakravarty, SHung, DTPham, SMHerrera, FJRai, R Novel 3-methylindoline inhibitors of EZH2: Design, synthesis and SAR. Bioorg Med Chem Lett 27:217-222 (2017)  
Target
Name:
Histone-lysine N-methyltransferase EZH1
Synonyms:
ENX-2 EZH1_HUMAN Enhancer of zeste homolog 1 (EZH1) KIAA0388
Type:
Protein
Mol. Mass.:
85285.34
Organism:
Homo sapiens (Human)
Description:
Q92800
Residue:
747
  
Inhibitor
Name:
BDBM50205626
Synonyms:
CHEMBL3900506
Type:
Small organic molecule
Emp. Form.:
C32H40N6O3
Mol. Mass.:
556.6984
SMILES:
CC1CN(C2CCOCC2)c2cc(cc(C(=O)NCc3c(C)cc(C)[nH]c3=O)c12)-c1ccc(nc1)N1CCNCC1
: