Target
Platelet-activating factor acetylhydrolase
Ligand
BDBM50125265
Substrate
Meas. Tech.
ChEMBL_1628545 (CHEMBL3871130)
IC50
0.063096±n/a nM
Citation
 Measom, NDDown, KDHirst, DJJamieson, CManas, ESPatel, VKSomers, DO Investigation of a Bicyclo[1.1.1]pentane as a Phenyl Replacement within an LpPLA ACS Med Chem Lett 8:43-48 (2017)  
Target
Name:
Platelet-activating factor acetylhydrolase
Synonyms:
1-alkyl-2-acetylglycerophosphocholine esterase LDL-PLA(2) PAF 2-acylhydrolase PAFAH PLA2G7 | Platelet-activating factor acetylhydrolase
Type:
PROTEIN
Mol. Mass.:
50084.41
Organism:
Homo sapiens (Human)
Description:
ChEMBL_156212
Residue:
441
  
Inhibitor
Name:
BDBM50125265
Synonyms:
CHEMBL204021 | N-(2-Diethylamino-ethyl)-2-[2-(4-fluoro-benzylsulfanyl)-4-oxo-4,5,6,7-tetrahydro-cyclopentapyrimidin-1-yl]-N-(4'-trifluoromethyl-biphenyl-4-ylmethyl)-acetamide
Type:
Small organic molecule
Emp. Form.:
C36H38F4N4O2S
Mol. Mass.:
666.771
SMILES:
CCN(CC)CCN(Cc1ccc(cc1)-c1ccc(cc1)C(F)(F)F)C(=O)Cn1c2CCCc2c(=O)nc1SCc1ccc(F)cc1
: