Target
Kallikrein-1
Ligand
BDBM50205819
Substrate
Meas. Tech.
ChEMBL_1628568 (CHEMBL3871153)
Ki
23±n/a nM
Citation
 Richter, JMCheney, DLBates, JAWei, ALuettgen, JMRendina, ARHarper, TMNarayanan, RWong, PCSeiffert, DWexler, RRPriestley, ES Design and Synthesis of Novel Meta-Linked Phenylglycine Macrocyclic FVIIa Inhibitors. ACS Med Chem Lett 8:67-72 (2017)  
Target
Name:
Kallikrein-1
Synonyms:
KLK1 Kallikrein 1 Kidney/pancreas/salivary gland kallikrein | Tissue kallikrein
Type:
Enzyme
Mol. Mass.:
28874.69
Organism:
Homo sapiens (Human)
Description:
P06870
Residue:
262
  
Inhibitor
Name:
BDBM50205819
Synonyms:
CHEMBL3978462
Type:
Small organic molecule
Emp. Form.:
C34H34F3N5O5S
Mol. Mass.:
681.724
SMILES:
C[C@H]1CC(=O)Nc2ccc(c(CN(C)C(=O)[C@H](Nc3ccc4c(N)ncc(F)c4c3)c3ccc(OCC(F)F)c1c3)c2)S(=O)(=O)C1CC1
: