Target
Coagulation factor VII/Tissue factor
Ligand
BDBM50205843
Substrate
Meas. Tech.
ChEMBL_1628566 (CHEMBL3871151)
Ki
3.8±n/a nM
Citation
 Richter, JMCheney, DLBates, JAWei, ALuettgen, JMRendina, ARHarper, TMNarayanan, RWong, PCSeiffert, DWexler, RRPriestley, ES Design and Synthesis of Novel Meta-Linked Phenylglycine Macrocyclic FVIIa Inhibitors. ACS Med Chem Lett 8:67-72 (2017)  
Target
Name:
Coagulation factor VII/Tissue factor
Synonyms:
Coagulation factor III/Factor VIIa (fVIIa) | Coagulation factor III/VII
Type:
Mol. Mass.:
Description:
ASSAY_ID of EBI is 69535
Components:
This complex has 2 components.
Component 1
Name:
Tissue factor
Synonyms:
CD_antigen=CD142 Coagulation factor VII/tissue factor TF Thromboplastin | Tissue factor
Type:
PROTEIN
Mol. Mass.:
33067.61
Organism:
Homo sapiens (Human)
Description:
ChEMBL_936735
Residue:
295
  
Component 2
Name:
Coagulation factor VII
Synonyms:
Eptacog alfa FA7_HUMAN Factor VIIa (fVIIa) SPCA serum prothrombin conversion accelerator
Type:
Enzyme
Mol. Mass.:
51599.89
Organism:
Homo sapiens (Human)
Description:
Residue:
466
  
Inhibitor
Name:
BDBM50205843
Synonyms:
CHEMBL3978216
Type:
Small organic molecule
Emp. Form.:
C34H37FN6O5S
Mol. Mass.:
660.758
SMILES:
COc1ccc2cc1[C@@H](C)CN(C)C(=O)Nc1ccc(c(CN(C)C(=O)[C@@H]2Nc2ccc3c(N)ncc(F)c3c2)c1)S(=O)(=O)C1CC1
: