Target
Prostaglandin E2 receptor EP3 subtype
Ligand
BDBM50206015
Substrate
Meas. Tech.
ChEMBL_1628613 (CHEMBL3871198)
EC50
870±n/a nM
Citation
 Sugimoto, IKambe, TOkino, TObitsu, TOhta, NNishiyama, TKinoshita, AFujimoto, TEgashira, HYamane, SShuto, STani, KMaruyama, T Discovery of Novel Seven-Membered Prostacyclin Analogues as Potent and Selective Prostaglandin FP and EP3 Dual Agonists. ACS Med Chem Lett 8:107-112 (2017)  
Target
Name:
Prostaglandin E2 receptor EP3 subtype
Synonyms:
PE2R3_HUMAN PGE2-R Prostaglandin E2 receptor Prostaglandin E2 receptor EP3 subtype (EP3) Prostaglandin E2 receptor EP3D subtype (EP3D) | Prostanoid EP3 receptor
Type:
Enzyme
Mol. Mass.:
43335.03
Organism:
Homo sapiens (Human)
Description:
P43115
Residue:
390
  
Inhibitor
Name:
BDBM50206015
Synonyms:
CHEMBL3984438
Type:
Small organic molecule
Emp. Form.:
C22H30O6
Mol. Mass.:
390.47
SMILES:
[H][C@]12C[C@@H](O)[C@H](\C=C\[C@@H](O)COc3ccccc3)[C@@]1([H])CC[C@@H](CCC(O)=O)CO2
: