Target
Prostaglandin E2 receptor EP3 subtype
Ligand
BDBM50206016
Substrate
Meas. Tech.
ChEMBL_1628613 (CHEMBL3871198)
EC50
0.340000±n/a nM
Citation
 Sugimoto, IKambe, TOkino, TObitsu, TOhta, NNishiyama, TKinoshita, AFujimoto, TEgashira, HYamane, SShuto, STani, KMaruyama, T Discovery of Novel Seven-Membered Prostacyclin Analogues as Potent and Selective Prostaglandin FP and EP3 Dual Agonists. ACS Med Chem Lett 8:107-112 (2017)  
Target
Name:
Prostaglandin E2 receptor EP3 subtype
Synonyms:
PE2R3_HUMAN PGE2-R Prostaglandin E2 receptor Prostaglandin E2 receptor EP3 subtype (EP3) Prostaglandin E2 receptor EP3D subtype (EP3D) | Prostanoid EP3 receptor
Type:
Enzyme
Mol. Mass.:
43335.03
Organism:
Homo sapiens (Human)
Description:
P43115
Residue:
390
  
Inhibitor
Name:
BDBM50206016
Synonyms:
CHEMBL3889508
Type:
Small organic molecule
Emp. Form.:
C23H33NO7S
Mol. Mass.:
467.576
SMILES:
CS(=O)(=O)NC(=O)CCC\C=C/C[C@H]1[C@@H](O)C[C@@H](O)[C@@H]1\C=C\[C@@H](O)COc1ccccc1
: