Target
Myeloperoxidase
Ligand
BDBM50206366
Substrate
Meas. Tech.
ChEMBL_1628935 (CHEMBL3871561)
IC50
490±n/a nM
Citation
 Aldib, IGelbcke, MSoubhye, JPrévost, MFurtmüller, PGObinger, CElfving, BAlard, ICRoos, GDelporte, CBerger, GDufour, DZouaoui Boudjeltia, KNève, JDufrasne, FVan Antwerpen, P Novel bis-arylalkylamines as myeloperoxidase inhibitors: Design, synthesis, and structure-activity relationship study. Eur J Med Chem 123:746-762 (2016)  
Target
Name:
Myeloperoxidase
Synonyms:
84 kDa myeloperoxidase MPO Myeloperoxidase Myeloperoxidase heavy chain PERM_HUMAN
Type:
Enzyme
Mol. Mass.:
83888.32
Organism:
Homo sapiens (Human)
Description:
P05164
Residue:
745
  
Inhibitor
Name:
BDBM50206366
Synonyms:
CHEMBL3980103
Type:
Small organic molecule
Emp. Form.:
C16H18FNO
Mol. Mass.:
259.3186
SMILES:
Oc1ccccc1CCCNCc1ccc(F)cc1
: