Target
Myeloperoxidase
Ligand
BDBM50206369
Substrate
Meas. Tech.
ChEMBL_1628935 (CHEMBL3871561)
IC50
700±n/a nM
Citation
 Aldib, IGelbcke, MSoubhye, JPrévost, MFurtmüller, PGObinger, CElfving, BAlard, ICRoos, GDelporte, CBerger, GDufour, DZouaoui Boudjeltia, KNève, JDufrasne, FVan Antwerpen, P Novel bis-arylalkylamines as myeloperoxidase inhibitors: Design, synthesis, and structure-activity relationship study. Eur J Med Chem 123:746-762 (2016)  
Target
Name:
Myeloperoxidase
Synonyms:
84 kDa myeloperoxidase MPO Myeloperoxidase Myeloperoxidase heavy chain PERM_HUMAN
Type:
Enzyme
Mol. Mass.:
83888.32
Organism:
Homo sapiens (Human)
Description:
P05164
Residue:
745
  
Inhibitor
Name:
BDBM50206369
Synonyms:
CHEMBL3925807
Type:
Small organic molecule
Emp. Form.:
C15H17NO
Mol. Mass.:
227.3016
SMILES:
Oc1ccccc1CNCCc1ccccc1
: