Target
Myeloperoxidase
Ligand
BDBM50125096
Substrate
Meas. Tech.
ChEMBL_1628935 (CHEMBL3871561)
IC50
>10000±n/a nM
Citation
 Aldib, IGelbcke, MSoubhye, JPrévost, MFurtmüller, PGObinger, CElfving, BAlard, ICRoos, GDelporte, CBerger, GDufour, DZouaoui Boudjeltia, KNève, JDufrasne, FVan Antwerpen, P Novel bis-arylalkylamines as myeloperoxidase inhibitors: Design, synthesis, and structure-activity relationship study. Eur J Med Chem 123:746-762 (2016)  
Target
Name:
Myeloperoxidase
Synonyms:
84 kDa myeloperoxidase MPO Myeloperoxidase Myeloperoxidase heavy chain PERM_HUMAN
Type:
Enzyme
Mol. Mass.:
83888.32
Organism:
Homo sapiens (Human)
Description:
P05164
Residue:
745
  
Inhibitor
Name:
BDBM50125096
Synonyms:
1,4-Dibenzyl-piperazine 1,4-Dibenzylpiperazine US10166229, Example 00032
Type:
Small organic molecule
Emp. Form.:
C18H22N2
Mol. Mass.:
266.3807
SMILES:
C(N1CCN(Cc2ccccc2)CC1)c1ccccc1
: