Target
Transthyretin
Ligand
BDBM50206387
Substrate
Meas. Tech.
ChEMBL_1628944 (CHEMBL3871570)
IC50
1900±n/a nM
Citation
 Kim, BPark, HLee, SKPark, SJKoo, TSKang, NSHong, KBChoi, S Systemic optimization and structural evaluation of quinoline derivatives as transthyretin amyloidogenesis inhibitors. Eur J Med Chem 123:777-787 (2016)  
Target
Name:
Transthyretin
Synonyms:
ATTR Prealbumin TTHY_HUMAN Transthyretin (TTR)
Type:
Enzyme
Mol. Mass.:
15884.31
Organism:
Homo sapiens (Human)
Description:
P02766
Residue:
147
  
Inhibitor
Name:
BDBM50206387
Synonyms:
CHEMBL3898378
Type:
Small organic molecule
Emp. Form.:
C19H16N2O
Mol. Mass.:
288.3431
SMILES:
Cc1cc(cc(C)c1O)C#Cc1ccc2cc(N)ccc2n1
: