Target
Serine/threonine-protein kinase PLK1
Ligand
BDBM50206449
Substrate
Meas. Tech.
ChEMBL_1629008 (CHEMBL3871634)
Kd
5100±n/a nM
Citation
 Yun, TQin, TLiu, YLai, L Identification of acylthiourea derivatives as potent Plk1 PBD inhibitors. Eur J Med Chem 124:229-236 (2016)  
Target
Name:
Serine/threonine-protein kinase PLK1
Synonyms:
PLK PLK1 Polo-like kinase 1 (PlK1) STPK13 Serine/threonine-protein kinase 13 | polo-like kinase
Type:
Serine/threonine-protein kinase
Mol. Mass.:
68277.16
Organism:
Homo sapiens (Human)
Description:
P53350
Residue:
603
  
Inhibitor
Name:
BDBM50206449
Synonyms:
CHEMBL3944679
Type:
Small organic molecule
Emp. Form.:
C14H11Cl2N3O3S2
Mol. Mass.:
404.291
SMILES:
NS(=O)(=O)c1cc(Cl)c(NC(=S)NC(=O)c2ccccc2)c(Cl)c1
: