Target
Thioredoxin reductase
Ligand
BDBM50206471
Substrate
Meas. Tech.
ChEMBL_1629022 (CHEMBL3871648)
Ki
6230±n/a nM
Citation
 Ansari, MFSiddiqui, SMAhmad, KAvecilla, FDharavath, SGourinath, SAzam, A Synthesis, antiamoebic and molecular docking studies of furan-thiazolidinone hybrids. Eur J Med Chem 124:393-406 (2016)  
Target
Name:
Thioredoxin reductase
Synonyms:
Type:
PROTEIN
Mol. Mass.:
33740.27
Organism:
Entamoeba histolytica
Description:
ChEMBL_116971
Residue:
314
  
Inhibitor
Name:
BDBM50206471
Synonyms:
CHEMBL3968932
Type:
Small organic molecule
Emp. Form.:
C21H15ClN2O2S
Mol. Mass.:
394.874
SMILES:
Clc1ccc(\C=C2/S\C(=N/c3ccccc3)N(Cc3ccco3)C2=O)cc1
: