Target
Neurotensin receptor type 2
Ligand
BDBM50206710
Substrate
Meas. Tech.
ChEMBL_1629221 (CHEMBL3871847)
Ki
12±n/a nM
Citation
 Simeth, NABause, MDobmeier, MKling, RCLachmann, DHübner, HEinsiedel, JGmeiner, PKönig, B NTS2-selective neurotensin mimetics with tetrahydrofuran amino acids. Bioorg Med Chem 25:350-359 (2017)  
Target
Name:
Neurotensin receptor type 2
Synonyms:
Levocabastine-sensitive neurotensin receptor NTR2 NTR2_HUMAN Neurotensin receptor Neurotensin receptor type 2
Type:
PROTEIN
Mol. Mass.:
45404.76
Organism:
Homo sapiens (Human)
Description:
ChEMBL_1281495
Residue:
410
  
Inhibitor
Name:
BDBM50206710
Synonyms:
CHEMBL3959801
Type:
Small organic molecule
Emp. Form.:
C40H66N12O9
Mol. Mass.:
859.027
SMILES:
CC[C@H](C)[C@H](NC(=O)[C@@]1(CCO[C@@H]1c1ccc(O)cc1)NC(=O)[C@@H]1CCCN1C(=O)[C@H](CCCNC(N)=N)NC(=O)[C@@H](N)CCCNC(N)=N)C(=O)N[C@@H](CC(C)C)C(O)=O
: