Target
5-hydroxytryptamine receptor 2B
Ligand
BDBM50206730
Substrate
Meas. Tech.
ChEMBL_1629225 (CHEMBL3871851)
EC50
7.9±n/a nM
Citation
 Schrader, TOKasem, MRen, AFeichtinger, KAl Doori, BWei, JWu, CDang, HLe, MGatlin, JChase, KDong, JWhelan, KTSage, CGrottick, AJSemple, G Tetrahydroquinoline-based tricyclic amines as potent and selective agonists of the 5-HT Bioorg Med Chem Lett 26:5877-5882 (2016)  
Target
Name:
5-hydroxytryptamine receptor 2B
Synonyms:
5-HT-2B 5-hydroxytryptamine (serotonin) receptor 2B [Homo sapiens] 5-hydroxytryptamine receptor 2C (5HT2C) HTR2B Serotonin 2b (5-HT2b) receptor | Serotonin Receptor 2B
Type:
G Protein-Coupled Receptor (GPCR)
Mol. Mass.:
54312.47
Organism:
Homo sapiens (Human)
Description:
Receptor binding assays were performed using human clone stably expressed in CHO cells.
Residue:
481
  
Inhibitor
Name:
BDBM50206730
Synonyms:
CHEMBL3934644
Type:
Small organic molecule
Emp. Form.:
C14H19ClN2O
Mol. Mass.:
266.766
SMILES:
[H][C@]12CCc3ccc(OC)c(Cl)c3N1CCCNC2
: