Target
5-hydroxytryptamine receptor 2A
Ligand
BDBM50206718
Substrate
Meas. Tech.
ChEMBL_1629231 (CHEMBL3871857)
Ki
1995±n/a nM
Citation
 Schrader, TOKasem, MRen, AFeichtinger, KAl Doori, BWei, JWu, CDang, HLe, MGatlin, JChase, KDong, JWhelan, KTSage, CGrottick, AJSemple, G Tetrahydroquinoline-based tricyclic amines as potent and selective agonists of the 5-HT Bioorg Med Chem Lett 26:5877-5882 (2016)  
Target
Name:
5-hydroxytryptamine receptor 2A
Synonyms:
5-HT-2 5-HT2A 5-hydroxytryptamine receptor 2A (5HT-2A) 5HT2A_HUMAN HTR2A | Serotonin receptor 2A
Type:
undefined
Mol. Mass.:
52607.65
Organism:
Homo sapiens (Human)
Description:
P28223
Residue:
471
  
Inhibitor
Name:
BDBM50206718
Synonyms:
CHEMBL3895972
Type:
Small organic molecule
Emp. Form.:
C14H19ClN2
Mol. Mass.:
250.767
SMILES:
CC1(C)Cc2cccc(Cl)c2N2CCNCC12
: