Target
Fibroblast growth factor receptor 1
Ligand
BDBM50206819
Substrate
Meas. Tech.
ChEMBL_1629291 (CHEMBL3871917)
Ki
80±n/a nM
Citation
 Morioka, M 3-Cyano-6-(5-methyl-3-pyrazoloamino) pyridines (Part 2): A dual inhibitor of Aurora kinase and tubulin polymerization. Bioorg Med Chem Lett 26:5860-5862 (2016)  
Target
Name:
Fibroblast growth factor receptor 1
Synonyms:
BFGFR Basic fibroblast growth factor receptor 1 (FGFR1) CEK FGFR-1 FGFR-1, (FL) FGFR1_HUMAN FLT2 Fibroblast growth factor receptor 1 (FGFR-1) Fms-like tyrosine kinase 2 N-sam bFGF-R | c-fgr
Type:
Receptor
Mol. Mass.:
91861.70
Organism:
Homo sapiens (Human)
Description:
P11362
Residue:
822
  
Inhibitor
Name:
BDBM50206819
Synonyms:
CHEMBL3893914
Type:
Small organic molecule
Emp. Form.:
C19H21N7O
Mol. Mass.:
363.4163
SMILES:
Cc1cc(Nc2cc(C)c(C#N)c(NCCOc3ccc(C)nc3)n2)n[nH]1
: