Target
Acetylcholinesterase
Ligand
BDBM50206876
Substrate
Meas. Tech.
ChEMBL_1629364 (CHEMBL3871990)
IC50
>100000±n/a nM
Citation
 Ko?ak, UKnez, DCoquelle, NBrus, BPi?lar, ANachon, FBrazzolotto, XKos, JColletier, JPGobec, S N-Propargylpiperidines with naphthalene-2-carboxamide or naphthalene-2-sulfonamide moieties: Potential multifunctional anti-Alzheimer's agents. Bioorg Med Chem 25:633-645 (2017)  
Target
Name:
Acetylcholinesterase
Synonyms:
ACES_MOUSE Acetylcholinesterase (mouse AChE) Ache
Type:
Enzyme
Mol. Mass.:
68165.65
Organism:
Mus musculus (mouse)
Description:
Residue:
614
  
Inhibitor
Name:
BDBM50206876
Synonyms:
CHEMBL3915915
Type:
Small organic molecule
Emp. Form.:
C20H22N2O
Mol. Mass.:
306.4015
SMILES:
O=C(NCC1CCCN(CC#C)C1)c1ccc2ccccc2c1
: