Target
Cholinesterase
Ligand
BDBM50206869
Substrate
Meas. Tech.
ChEMBL_1629363 (CHEMBL3871989)
IC50
3306±n/a nM
Citation
 Ko?ak, UKnez, DCoquelle, NBrus, BPi?lar, ANachon, FBrazzolotto, XKos, JColletier, JPGobec, S N-Propargylpiperidines with naphthalene-2-carboxamide or naphthalene-2-sulfonamide moieties: Potential multifunctional anti-Alzheimer's agents. Bioorg Med Chem 25:633-645 (2017)  
Target
Name:
Cholinesterase
Synonyms:
Acylcholine acylhydrolase Butyrylcholine esterase (BChE) Butyrylcholinesterase (BuChE) CHLE_HUMAN Cholinesterases Pseudocholinesterase
Type:
Homotetramer
Mol. Mass.:
68422.27
Organism:
Homo sapiens (Human)
Description:
P06276
Residue:
602
  
Inhibitor
Name:
BDBM50206869
Synonyms:
CHEMBL3964515
Type:
Small organic molecule
Emp. Form.:
C23H28N2O2
Mol. Mass.:
364.4806
SMILES:
COCCN(CC1CCCN(CC#C)C1)C(=O)c1ccc2ccccc2c1
: