Target
Pancreatic triacylglycerol lipase
Ligand
BDBM50207385
Substrate
Meas. Tech.
ChEBML_1631109
IC50
17900±n/a nM
Citation
 Sridhar, SNGinson, GVenkataramana Reddy, POTantak, MPKumar, DPaul, AT Synthesis, evaluation and molecular modelling studies of 2-(carbazol-3-yl)-2-oxoacetamide analogues as a new class of potential pancreatic lipase inhibitors. Bioorg Med Chem 25:609-620 (2017)  
Target
Name:
Pancreatic triacylglycerol lipase
Synonyms:
LIPP_HUMAN PNLIP | Pancreatic lipase
Type:
PROTEIN
Mol. Mass.:
51157.75
Organism:
Homo sapiens (Human)
Description:
ChEMBL_527250
Residue:
465
  
Inhibitor
Name:
BDBM50207385
Synonyms:
CHEBI:6646 Rel-(+)-Mahanimbine
Type:
Small organic molecule
Emp. Form.:
C23H25NO
Mol. Mass.:
331.4507
SMILES:
CC(C)=CCCC1(C)Oc2c(C)cc3c([nH]c4ccccc34)c2C=C1
: