Target
Pancreatic triacylglycerol lipase
Ligand
BDBM50207386
Substrate
Meas. Tech.
ChEMBL_1631106 (CHEMBL3873812)
Ki
17500±n/a nM
Citation
 Sridhar, SNGinson, GVenkataramana Reddy, POTantak, MPKumar, DPaul, AT Synthesis, evaluation and molecular modelling studies of 2-(carbazol-3-yl)-2-oxoacetamide analogues as a new class of potential pancreatic lipase inhibitors. Bioorg Med Chem 25:609-620 (2017)  
Target
Name:
Pancreatic triacylglycerol lipase
Synonyms:
LIPP_PIG PNLIP Pancreatic lipase | Pancreatic triacylglycerol lipase
Type:
Enzyme
Mol. Mass.:
50080.69
Organism:
Sus scrofa (Pig)
Description:
P00591
Residue:
450
  
Inhibitor
Name:
BDBM50207386
Synonyms:
CHEMBL3967165
Type:
Small organic molecule
Emp. Form.:
C29H23ClN2O4
Mol. Mass.:
498.957
SMILES:
COc1ccc(NC(=O)C(=O)c2ccc3n(Cc4ccc(Cl)cc4)c4ccccc4c3c2)cc1OC
: