Target
5-hydroxytryptamine receptor 6
Ligand
BDBM50207400
Substrate
Meas. Tech.
ChEMBL_1631230 (CHEMBL3873936)
Ki
>1790000±n/a nM
Citation
 Blanco, MJBenesh, DRKnobelsdorf, JAKhilevich, ACortez, GSMokube, FAicher, TDGroendyke, TMMarmsater, FPTang, TPJohnson, KWClemens-Smith, AMuhlhauser, MASwanson, SCatlow, JEmkey, RJohnson, MPSchkeryantz, JM Discovery of dual positive allosteric modulators (PAMs) of the metabotropic glutamate 2 receptor and CysLT1 antagonists for treating migraine headache. Bioorg Med Chem Lett 27:323-328 (2017)  
Target
Name:
5-hydroxytryptamine receptor 6
Synonyms:
5-HT-6 5-hydroxytryptamine receptor 6 (5-HT-6) 5-hydroxytryptamine receptor 6 (5HT6) HTR6 Serotonin 6 (5-HT6) receptor | Serotonin Receptor 6
Type:
G Protein-Coupled Receptor (GPCR)
Mol. Mass.:
46968.43
Organism:
Homo sapiens (Human)
Description:
P50406
Residue:
440
  
Inhibitor
Name:
BDBM50207400
Synonyms:
CHEMBL3899832
Type:
Small organic molecule
Emp. Form.:
C22H19N5O4
Mol. Mass.:
417.4174
SMILES:
CC(=O)c1ccc(OCc2ccc(Oc3cc(ccn3)-c3nn[nH]n3)cc2)c(C)c1O
: