Target
Metabotropic glutamate receptor 2
Ligand
BDBM50207409
Substrate
Meas. Tech.
ChEMBL_1631168 (CHEMBL3873874)
EC50
294±n/a nM
Citation
 Blanco, MJBenesh, DRKnobelsdorf, JAKhilevich, ACortez, GSMokube, FAicher, TDGroendyke, TMMarmsater, FPTang, TPJohnson, KWClemens-Smith, AMuhlhauser, MASwanson, SCatlow, JEmkey, RJohnson, MPSchkeryantz, JM Discovery of dual positive allosteric modulators (PAMs) of the metabotropic glutamate 2 receptor and CysLT1 antagonists for treating migraine headache. Bioorg Med Chem Lett 27:323-328 (2017)  
Target
Name:
Metabotropic glutamate receptor 2
Synonyms:
GPRC1B GRM2_HUMAN Metabotropic glutamate receptor mGlu2 | metabotropic glutamate 2
Type:
Enzyme
Mol. Mass.:
95584.88
Organism:
Homo sapiens (Human)
Description:
Q14416
Residue:
872
  
Inhibitor
Name:
BDBM50207409
Synonyms:
CHEMBL3892611
Type:
Small organic molecule
Emp. Form.:
C23H20N4O4
Mol. Mass.:
416.4293
SMILES:
CC(=O)c1ccc(OCc2ccc(Oc3cccc(c3)-c3nn[nH]n3)cc2)c(C)c1O
: