Target
Cysteinyl leukotriene receptor 1
Ligand
BDBM50207408
Substrate
Meas. Tech.
ChEMBL_1631170 (CHEMBL3873876)
IC50
1500±n/a nM
Citation
 Blanco, MJBenesh, DRKnobelsdorf, JAKhilevich, ACortez, GSMokube, FAicher, TDGroendyke, TMMarmsater, FPTang, TPJohnson, KWClemens-Smith, AMuhlhauser, MASwanson, SCatlow, JEmkey, RJohnson, MPSchkeryantz, JM Discovery of dual positive allosteric modulators (PAMs) of the metabotropic glutamate 2 receptor and CysLT1 antagonists for treating migraine headache. Bioorg Med Chem Lett 27:323-328 (2017)  
Target
Name:
Cysteinyl leukotriene receptor 1
Synonyms:
CLTR1_HUMAN CYSLTR1 Cysteinyl leukotriene receptor HG55 LTD4 receptor | Leukotriene Cysteinyl 1
Type:
Enzyme Catalytic Domain
Mol. Mass.:
38565.16
Organism:
Homo sapiens (Human)
Description:
Leukotriene Cysteinyl 1 CYSLTR1 HUMAN::Q9Y271
Residue:
337
  
Inhibitor
Name:
BDBM50207408
Synonyms:
CHEMBL3943547
Type:
Small organic molecule
Emp. Form.:
C21H16FN5O4
Mol. Mass.:
421.3812
SMILES:
CC(=O)c1ccc(OCc2cccc(Oc3ccc(cn3)-c3nn[nH]n3)c2)c(F)c1O
: