Target
Metabotropic glutamate receptor 2
Ligand
BDBM50207405
Substrate
Meas. Tech.
ChEMBL_1631168 (CHEMBL3873874)
EC50
319±n/a nM
Citation
 Blanco, MJBenesh, DRKnobelsdorf, JAKhilevich, ACortez, GSMokube, FAicher, TDGroendyke, TMMarmsater, FPTang, TPJohnson, KWClemens-Smith, AMuhlhauser, MASwanson, SCatlow, JEmkey, RJohnson, MPSchkeryantz, JM Discovery of dual positive allosteric modulators (PAMs) of the metabotropic glutamate 2 receptor and CysLT1 antagonists for treating migraine headache. Bioorg Med Chem Lett 27:323-328 (2017)  
Target
Name:
Metabotropic glutamate receptor 2
Synonyms:
GPRC1B GRM2_HUMAN Metabotropic glutamate receptor mGlu2 | metabotropic glutamate 2
Type:
Enzyme
Mol. Mass.:
95584.88
Organism:
Homo sapiens (Human)
Description:
Q14416
Residue:
872
  
Inhibitor
Name:
BDBM50207405
Synonyms:
CHEMBL3918914
Type:
Small organic molecule
Emp. Form.:
C24H23N5O4
Mol. Mass.:
445.4705
SMILES:
CCCc1c(OCc2cccc(Oc3ccc(cn3)-c3nn[nH]n3)c2)ccc(C(C)=O)c1O
: