Target
Prostaglandin G/H synthase 2
Ligand
BDBM50207425
Substrate
Meas. Tech.
ChEMBL_1631942 (CHEMBL3874648)
IC50
7950±n/a nM
Citation
 Abdelazeem, AHEl-Saadi, MTSafi El-Din, AGOmar, HAEl-Moghazy, SM Design, synthesis and analgesic/anti-inflammatory evaluation of novel diarylthiazole and diarylimidazole derivatives towards selective COX-1 inhibitors with better gastric profile. Bioorg Med Chem 25:665-676 (2017)  
Target
Name:
Prostaglandin G/H synthase 2
Synonyms:
COX2 Cyclooxygenase 2 (COX-2) Cyclooxygenase-2 (COX-2 AA) Cyclooxygenase-2 (COX-2) PGH2_HUMAN PHS II Prostaglandin E synthase/G/H synthase 2 Prostaglandin-endoperoxide synthase 2
Type:
Enzyme
Mol. Mass.:
69003.89
Organism:
Homo sapiens (Human)
Description:
Recombinant Cox-2 provided by Cayman (Cayman Chemical Co.,Ann Arbor, MI).
Residue:
604
  
Inhibitor
Name:
BDBM50207425
Synonyms:
CHEMBL3935079
Type:
Small organic molecule
Emp. Form.:
C24H28N4O3S
Mol. Mass.:
452.569
SMILES:
COc1ccc(cc1)-c1nc(NCC(=O)N2CCN(C)CC2)sc1-c1ccc(OC)cc1
: