Target
Carbonic anhydrase 9
Ligand
BDBM27504
Substrate
Meas. Tech.
ChEMBL_1632054 (CHEMBL3874760)
Ki
15700±n/a nM
Citation
 Bozdag, MAlafeefy, AMAltamimi, AMVullo, DCarta, FSupuran, CT Coumarins and other fused bicyclic heterocycles with selective tumor-associated carbonic anhydrase isoforms inhibitory activity. Bioorg Med Chem 25:677-683 (2017)  
Target
Name:
Carbonic anhydrase 9
Synonyms:
CA-IX CAH9_HUMAN Carbonic anhydrase 9 (CA IX) Carbonic anhydrase 9 precursor Carbonic anhydrase IX (CAIX) Carbonic anhydrases; II & IX MN RCC-associated antigen G250
Type:
Enzyme
Mol. Mass.:
49669.03
Organism:
Homo sapiens (Human)
Description:
Catalytic domain of human cloned isozyme was used in the assay
Residue:
459
  
Inhibitor
Name:
BDBM27504
Synonyms:
4-HQN CHEMBL266540 | quinazolin-4-ol
Type:
Small organic molecule
Emp. Form.:
C8H6N2O
Mol. Mass.:
146.146
SMILES:
O=c1[nH]cnc2ccccc12
: