Target
Histone acetyltransferase KAT2B
Ligand
BDBM50207717
Substrate
Meas. Tech.
ChEMBL_1632235 (CHEMBL3874941)
Kd
73000±n/a nM
Citation
 Navratilova, IAristotelous, TPicaud, SChaikuad, AKnapp, SFilappakopoulos, PHopkins, AL Discovery of New Bromodomain Scaffolds by Biosensor Fragment Screening. ACS Med Chem Lett 7:1213-1218 (2016)  
Target
Name:
Histone acetyltransferase KAT2B
Synonyms:
Histone acetyltransferase KAT2A/KAT2B KAT2B PCAF
Type:
PROTEIN
Mol. Mass.:
93045.76
Organism:
Homo sapiens (Human)
Description:
ChEMBL_1502838
Residue:
832
  
Inhibitor
Name:
BDBM50207717
Synonyms:
CHEMBL3110243
Type:
Small organic molecule
Emp. Form.:
C13H17NO3
Mol. Mass.:
235.279
SMILES:
CNC(=O)c1ccccc1OC1CCOCC1
: