Target
CREB-binding protein
Ligand
BDBM50207718
Substrate
Meas. Tech.
ChEMBL_1632229 (CHEMBL3874935)
Kd
7080±n/a nM
Citation
 Navratilova, IAristotelous, TPicaud, SChaikuad, AKnapp, SFilappakopoulos, PHopkins, AL Discovery of New Bromodomain Scaffolds by Biosensor Fragment Screening. ACS Med Chem Lett 7:1213-1218 (2016)  
Target
Name:
CREB-binding protein
Synonyms:
CBP CREB-binding protein (CBP) CREBBP
Type:
Transcription Coactivator
Mol. Mass.:
265411.66
Organism:
Homo sapiens (Human)
Description:
Q92793
Residue:
2442
  
Inhibitor
Name:
BDBM50207718
Synonyms:
CHEMBL3959972
Type:
Small organic molecule
Emp. Form.:
C15H17N3O
Mol. Mass.:
255.315
SMILES:
CCC(=O)N1CCc2[nH]nc(c2C1)-c1ccccc1
: