Target
Bromodomain-containing protein 4
Ligand
BDBM50399448
Substrate
Meas. Tech.
ChEMBL_1632233 (CHEMBL3874939)
Kd
38900±n/a nM
Citation
 Navratilova, IAristotelous, TPicaud, SChaikuad, AKnapp, SFilappakopoulos, PHopkins, AL Discovery of New Bromodomain Scaffolds by Biosensor Fragment Screening. ACS Med Chem Lett 7:1213-1218 (2016)  
Target
Name:
Bromodomain-containing protein 4
Synonyms:
BRD4 Bromodomain-containing protein 4 (BRD4) Protein HUNK1
Type:
Protein
Mol. Mass.:
152264.84
Organism:
Homo sapiens (Human)
Description:
O60885
Residue:
1362
  
Inhibitor
Name:
BDBM50399448
Synonyms:
CHEMBL1230189
Type:
Small organic molecule
Emp. Form.:
C9H10N2O
Mol. Mass.:
162.1885
SMILES:
CN1Cc2ccccc2NC1=O
: