Target
Bromodomain-containing protein 4
Ligand
BDBM50207718
Substrate
Meas. Tech.
ChEMBL_1632231 (CHEMBL3874937)
Kd
8630±n/a nM
Citation
 Navratilova, IAristotelous, TPicaud, SChaikuad, AKnapp, SFilappakopoulos, PHopkins, AL Discovery of New Bromodomain Scaffolds by Biosensor Fragment Screening. ACS Med Chem Lett 7:1213-1218 (2016)  
Target
Name:
Bromodomain-containing protein 4
Synonyms:
BRD4 Bromodomain-containing protein 4 (BRD4) Protein HUNK1
Type:
Protein
Mol. Mass.:
152264.84
Organism:
Homo sapiens (Human)
Description:
O60885
Residue:
1362
  
Inhibitor
Name:
BDBM50207718
Synonyms:
CHEMBL3959972
Type:
Small organic molecule
Emp. Form.:
C15H17N3O
Mol. Mass.:
255.315
SMILES:
CCC(=O)N1CCc2[nH]nc(c2C1)-c1ccccc1
: