Target
Carbonic anhydrase 1
Ligand
BDBM50207737
Substrate
Meas. Tech.
ChEMBL_1632257 (CHEMBL3874963)
Ki
737±n/a nM
Citation
 Ivanova, JBalode, A?alubovskis, RLeitans, JKazaks, AVullo, DTars, KSupuran, CT 5-Substituted-benzylsulfanyl-thiophene-2-sulfonamides with effective carbonic anhydrase inhibitory activity: Solution and crystallographic investigations. Bioorg Med Chem 25:857-863 (2017)  
Target
Name:
Carbonic anhydrase 1
Synonyms:
CA-I CAB Carbonate dehydratase I Carbonic anhydrase 1 (CA I) Carbonic anhydrase 1 (Recombinant CA I) Carbonic anhydrase B Carbonic anhydrase I (CA I) Carbonic anhydrase I (CAI) Carbonic anhydrase isoenzyme I (hCA I) | hCA
Type:
Enzyme
Mol. Mass.:
28873.37
Organism:
Homo sapiens (Human)
Description:
P00915
Residue:
261
  
Inhibitor
Name:
BDBM50207737
Synonyms:
CHEMBL3928543
Type:
Small organic molecule
Emp. Form.:
C11H10FNO2S3
Mol. Mass.:
303.396
SMILES:
NS(=O)(=O)c1ccc(SCc2ccc(F)cc2)s1
: