Target
Free fatty acid receptor 1
Ligand
BDBM50208154
Substrate
Meas. Tech.
ChEMBL_1632279 (CHEMBL3874985)
EC50
2500±n/a nM
Citation
 Cox, JMChu, HDChelliah, MVDebenham, JSEagen, KLan, PLombardo, MLondon, CPlotkin, MAShah, USun, ZVaccaro, HMVenkatraman, SSuzuki, TWang, NAshley, ERCrespo, AMadeira, MLeung, DHAlleyne, COgawa, AMSouza, SThomas-Fowlkes, BDi Salvo, JWeinglass, AKirkland, MPachanski, MPowles, MATozzo, EAkiyama, TEUjjainwalla, FTata, JRSinz, CJ Design, Synthesis, and Evaluation of Novel and Selective G-protein Coupled Receptor 120 (GPR120) Spirocyclic Agonists. ACS Med Chem Lett 8:49-54 (2017)  
Target
Name:
Free fatty acid receptor 1
Synonyms:
FFAR1 G-protein Coupled Receptor 40 | GPR40
Type:
G Protein-Coupled Receptor (GPCR)
Mol. Mass.:
31473.32
Organism:
Homo sapiens (Human)
Description:
O14842
Residue:
300
  
Inhibitor
Name:
BDBM50208154
Synonyms:
CHEMBL3973034 | US9708270, 35
Type:
Small organic molecule
Emp. Form.:
C20H23F3N2O3
Mol. Mass.:
396.4034
SMILES:
OC(=O)CC1CCC2(CC1)CCN(CC2)c1cc(OC(F)(F)F)ccc1C#N
: