Target
Free fatty acid receptor 4
Ligand
BDBM50208150
Substrate
Meas. Tech.
ChEMBL_1632277 (CHEMBL3874983)
EC50
1200±n/a nM
Citation
 Cox, JMChu, HDChelliah, MVDebenham, JSEagen, KLan, PLombardo, MLondon, CPlotkin, MAShah, USun, ZVaccaro, HMVenkatraman, SSuzuki, TWang, NAshley, ERCrespo, AMadeira, MLeung, DHAlleyne, COgawa, AMSouza, SThomas-Fowlkes, BDi Salvo, JWeinglass, AKirkland, MPachanski, MPowles, MATozzo, EAkiyama, TEUjjainwalla, FTata, JRSinz, CJ Design, Synthesis, and Evaluation of Novel and Selective G-protein Coupled Receptor 120 (GPR120) Spirocyclic Agonists. ACS Med Chem Lett 8:49-54 (2017)  
Target
Name:
Free fatty acid receptor 4
Synonyms:
FFAR4 G-protein coupled receptor 120 G-protein coupled receptor GT01 GPR120 O3FAR1 PGR4
Type:
PROTEIN
Mol. Mass.:
42256.91
Organism:
Homo sapiens (Human)
Description:
ChEMBL_1508994
Residue:
377
  
Inhibitor
Name:
BDBM50208150
Synonyms:
CHEMBL3947837 | US9708270, 16
Type:
Small organic molecule
Emp. Form.:
C19H23F4NO2
Mol. Mass.:
373.385
SMILES:
OC(=O)CC1CCC2(CC1)CCN(CC2)c1cc(ccc1F)C(F)(F)F
: