Target
Free fatty acid receptor 4
Ligand
BDBM50208160
Substrate
Meas. Tech.
ChEMBL_1632277 (CHEMBL3874983)
EC50
440±n/a nM
Citation
 Cox, JMChu, HDChelliah, MVDebenham, JSEagen, KLan, PLombardo, MLondon, CPlotkin, MAShah, USun, ZVaccaro, HMVenkatraman, SSuzuki, TWang, NAshley, ERCrespo, AMadeira, MLeung, DHAlleyne, COgawa, AMSouza, SThomas-Fowlkes, BDi Salvo, JWeinglass, AKirkland, MPachanski, MPowles, MATozzo, EAkiyama, TEUjjainwalla, FTata, JRSinz, CJ Design, Synthesis, and Evaluation of Novel and Selective G-protein Coupled Receptor 120 (GPR120) Spirocyclic Agonists. ACS Med Chem Lett 8:49-54 (2017)  
Target
Name:
Free fatty acid receptor 4
Synonyms:
FFAR4 G-protein coupled receptor 120 G-protein coupled receptor GT01 GPR120 O3FAR1 PGR4
Type:
PROTEIN
Mol. Mass.:
42256.91
Organism:
Homo sapiens (Human)
Description:
ChEMBL_1508994
Residue:
377
  
Inhibitor
Name:
BDBM50208160
Synonyms:
CHEMBL3940359
Type:
Small organic molecule
Emp. Form.:
C20H25ClF3NO3
Mol. Mass.:
419.866
SMILES:
CC1CC(CC(O)=O)CCC11CCN(CC1)c1cc(OC(F)(F)F)ccc1Cl
: