Target
cAMP-specific 3',5'-cyclic phosphodiesterase 4D
Ligand
BDBM14361
Substrate
Meas. Tech.
ChEMBL_1632647 (CHEMBL3875439)
IC50
160±n/a nM
Citation
 Zhou, ZZGe, BCZhong, QPHuang, CCheng, YFYang, XMWang, HTXu, JP Development of highly potent phosphodiesterase 4 inhibitors with anti-neuroinflammation potential: Design, synthesis, and structure-activity relationship study of catecholamides bearing aromatic rings. Eur J Med Chem 124:372-379 (2016)  
Target
Name:
cAMP-specific 3',5'-cyclic phosphodiesterase 4D
Synonyms:
3',5'-cyclic phosphodiesterase PDE43 PDE4D_HUMAN | Phosphodiesterase 4D
Type:
Protein
Mol. Mass.:
91092.69
Organism:
Homo sapiens (Human)
Description:
Q08499
Residue:
809
  
Inhibitor
Name:
BDBM14361
Synonyms:
(R,S)-Rolipram 4-[3-(cyclopentyloxy)-4-methoxyphenyl]pyrrolidin-2-one CHEMBL63 | Rolipram
Type:
Small organic molecule
Emp. Form.:
C16H21NO3
Mol. Mass.:
275.3428
SMILES:
COc1ccc(cc1OC1CCCC1)C1CNC(=O)C1
: