Target
Aldo-keto reductase family 1 member B1
Ligand
BDBM50208584
Substrate
Meas. Tech.
ChEMBL_1632896 (CHEMBL3875688)
IC50
337±n/a nM
Citation
 Gopinath, GSankeshi, VPerugu, SAlaparthi, MDBandaru, SPasala, VKChittineni, PRKrupadanam, GLDSagurthi, SR Design and synthesis of chiral 2H-chromene-N-imidazolo-amino acid conjugates as aldose reductase inhibitors. Eur J Med Chem 124:750-762 (2016)  
Target
Name:
Aldo-keto reductase family 1 member B1
Synonyms:
ALDR_RAT Akr1b4 Aldr1
Type:
PROTEIN
Mol. Mass.:
35797.87
Organism:
Rattus norvegicus
Description:
ChEMBL_1512484
Residue:
316
  
Inhibitor
Name:
BDBM50208584
Synonyms:
CHEMBL3884168
Type:
Small organic molecule
Emp. Form.:
C23H20ClN3O2
Mol. Mass.:
405.877
SMILES:
Clc1ccc(cc1)-c1cnc([nH]1)[C@@H]1CCCN1C(=O)C1=Cc2ccccc2OC1
: