Target
Broad substrate specificity ATP-binding cassette transporter ABCG2
Ligand
BDBM50208621
Substrate
Meas. Tech.
ChEMBL_1633055 (CHEMBL3875847)
IC50
117±n/a nM
Citation
 Köhler, SCSilbermann, KWiese, M Phenyltetrazolyl-phenylamides: Substituent impact on modulation capability and selectivity toward the efflux protein ABCG2 and investigation of interaction with the transporter. Eur J Med Chem 124:881-895 (2016)  
Target
Name:
Broad substrate specificity ATP-binding cassette transporter ABCG2
Synonyms:
ABCG2 ABCP ATP-binding cassette sub-family G member 2 ATP-binding cassette, sub-family G, member 2 BCRP1 CDw338 Mitoxantrone resistance-associated protein Urate exporter
Type:
Multi-pass membrane protein; monomer or homodimer; disulfide-linked
Mol. Mass.:
72329.48
Organism:
Homo sapiens (Human)
Description:
Q9UNQ0
Residue:
655
  
Inhibitor
Name:
BDBM50208621
Synonyms:
CHEMBL3885113
Type:
Small organic molecule
Emp. Form.:
C21H16N6O3S
Mol. Mass.:
432.455
SMILES:
CSc1ccc(cc1)-n1nnc(n1)-c1ccccc1NC(=O)c1ccccc1[N+]([O-])=O
: