Target
Dual specificity protein kinase CLK2
Ligand
BDBM50140932
Substrate
Meas. Tech.
ChEMBL_1633067 (CHEMBL3875859)
IC50
4600±n/a nM
Citation
 Labrière, CLozach, OBlairvacq, MMeijer, LGuillou, C Further investigation of Paprotrain: Towards the conception of selective and multi-targeted CNS kinase inhibitors. Eur J Med Chem 124:920-934 (2016)  
Target
Name:
Dual specificity protein kinase CLK2
Synonyms:
2.7.12.1 CDC-like kinase 2 (CLK2) CLK2 | CLK2_HUMAN
Type:
Mol. Mass.:
60128.79
Organism:
Homo sapiens (Human)
Description:
P49760
Residue:
499
  
Inhibitor
Name:
BDBM50140932
Synonyms:
CHEMBL3753668
Type:
Small organic molecule
Emp. Form.:
C15H10N4
Mol. Mass.:
246.2667
SMILES:
N#C\C(=C/c1cccnc1)c1c[nH]c2ncccc12
: