Target
Dual specificity protein kinase CLK1
Ligand
BDBM50208709
Substrate
Meas. Tech.
ChEMBL_1633065 (CHEMBL3875857)
IC50
51±n/a nM
Citation
 Labrière, CLozach, OBlairvacq, MMeijer, LGuillou, C Further investigation of Paprotrain: Towards the conception of selective and multi-targeted CNS kinase inhibitors. Eur J Med Chem 124:920-934 (2016)  
Target
Name:
Dual specificity protein kinase CLK1
Synonyms:
CDC-like kinase 1 CDC2-like kinase 1 (CLK1) CLK1 Dual specificity protein kinase CLK1 Dual specificty protein kinase CLK1
Type:
Protein
Mol. Mass.:
57322.21
Organism:
Homo sapiens (Human)
Description:
P49759
Residue:
484
  
Inhibitor
Name:
BDBM50208709
Synonyms:
CHEMBL3883639
Type:
Small organic molecule
Emp. Form.:
C17H11N3O
Mol. Mass.:
273.2887
SMILES:
COc1ccc2[nH]c3c(c(cc4cnccc34)C#N)c2c1
: