Target
Serine/threonine-protein kinase BRSK2
Ligand
BDBM50208918
Substrate
Meas. Tech.
ChEMBL_1633233 (CHEMBL3876025)
IC50
>10000±n/a nM
Citation
 Katz, JDHaidle, AChilders, KKZabierek, AAJewell, JPHou, YAltman, MDSzewczak, AChen, DHarsch, AHayashi, MWarren, LHutton, MNuthall, HSu, HPMunshi, SStanton, MGDavies, IWMunoz, BNorthrup, A Structure guided design of a series of selective pyrrolopyrimidinone MARK inhibitors. Bioorg Med Chem Lett 27:114-120 (2017)  
Target
Name:
Serine/threonine-protein kinase BRSK2
Synonyms:
BR serine/threonine-protein kinase 2 BRSK2_HUMAN PEN11B STK29
Type:
PROTEIN
Mol. Mass.:
81657.07
Organism:
Homo sapiens (Human)
Description:
ChEMBL_586949
Residue:
736
  
Inhibitor
Name:
BDBM50208918
Synonyms:
CHEMBL3883802
Type:
Small organic molecule
Emp. Form.:
C20H24N4O
Mol. Mass.:
336.4308
SMILES:
CC1(C)C(=O)N(C2CCCCC2)c2nc(Nc3ccccc3)ncc12
: