Target
Vascular endothelial growth factor receptor 2
Ligand
BDBM50208911
Substrate
Meas. Tech.
ChEMBL_1633271 (CHEMBL3876063)
IC50
1445±n/a nM
Citation
 Katz, JDHaidle, AChilders, KKZabierek, AAJewell, JPHou, YAltman, MDSzewczak, AChen, DHarsch, AHayashi, MWarren, LHutton, MNuthall, HSu, HPMunshi, SStanton, MGDavies, IWMunoz, BNorthrup, A Structure guided design of a series of selective pyrrolopyrimidinone MARK inhibitors. Bioorg Med Chem Lett 27:114-120 (2017)  
Target
Name:
Vascular endothelial growth factor receptor 2
Synonyms:
CD_antigen=CD309 Fetal liver kinase 1 (FLK-1) KDR Protein-tyrosine kinase receptor Flk-1 VEGFR-2 VEGFR2 Vascular Endothelial Growth Factor Receptor Kinase 2 Vascular endothelial growth factor receptor 2 (KDR) Vascular endothelial growth factor receptor 2 (VEGFR2) Vascular endothelial growth factor receptor-2 (VEGFR-2)
Type:
Receptor Tyrosine Kinase
Mol. Mass.:
151510.97
Organism:
Homo sapiens (Human)
Description:
P35968
Residue:
1356
  
Inhibitor
Name:
BDBM50208911
Synonyms:
CHEMBL3884319
Type:
Small organic molecule
Emp. Form.:
C23H22N4O2
Mol. Mass.:
386.4464
SMILES:
CC1(C)C(=O)N([C@H]2CCc3c2cccc3O)c2nc(Nc3ccccc3)ncc12
: