Target
Glycogen synthase kinase-3 alpha
Ligand
BDBM50208911
Substrate
Meas. Tech.
ChEMBL_1633298 (CHEMBL3876090)
IC50
3308±n/a nM
Citation
 Katz, JDHaidle, AChilders, KKZabierek, AAJewell, JPHou, YAltman, MDSzewczak, AChen, DHarsch, AHayashi, MWarren, LHutton, MNuthall, HSu, HPMunshi, SStanton, MGDavies, IWMunoz, BNorthrup, A Structure guided design of a series of selective pyrrolopyrimidinone MARK inhibitors. Bioorg Med Chem Lett 27:114-120 (2017)  
Target
Name:
Glycogen synthase kinase-3 alpha
Synonyms:
GSK-3 alpha GSK3A_HUMAN Glycogen synthase kinase-3 Glycogen synthase kinase-3 alpha (GSK3 Alpha) Glycogen synthase kinase-3 alpha (GSK3alpha)
Type:
Enzyme
Mol. Mass.:
50991.79
Organism:
Homo sapiens (Human)
Description:
P49840
Residue:
483
  
Inhibitor
Name:
BDBM50208911
Synonyms:
CHEMBL3884319
Type:
Small organic molecule
Emp. Form.:
C23H22N4O2
Mol. Mass.:
386.4464
SMILES:
CC1(C)C(=O)N([C@H]2CCc3c2cccc3O)c2nc(Nc3ccccc3)ncc12
: