Target
5'-AMP-activated protein kinase catalytic subunit alpha-2/subunit beta-1/subunit gamma-1
Ligand
BDBM50208911
Substrate
Meas. Tech.
ChEMBL_1633254 (CHEMBL3876046)
IC50
206±n/a nM
Citation
 Katz, JDHaidle, AChilders, KKZabierek, AAJewell, JPHou, YAltman, MDSzewczak, AChen, DHarsch, AHayashi, MWarren, LHutton, MNuthall, HSu, HPMunshi, SStanton, MGDavies, IWMunoz, BNorthrup, A Structure guided design of a series of selective pyrrolopyrimidinone MARK inhibitors. Bioorg Med Chem Lett 27:114-120 (2017)  
Target
Name:
5'-AMP-activated protein kinase catalytic subunit alpha-2/subunit beta-1/subunit gamma-1
Synonyms:
AMPK alpha2/beta1/gamma1 AMPK complex 7 (containing alpha-2, beta-1, gamma-1)
Type:
Mol. Mass.:
Description:
ASSAY_ID of ChEMBL is 1970361
Components:
This complex has 3 components.
Component 1
Name:
5'-AMP-activated protein kinase catalytic subunit alpha-2
Synonyms:
AAPK2_HUMAN AMP-activated protein kinase, alpha-2 subunit AMPK subunit alpha-2 AMPK2 Hydroxymethylglutaryl-CoA reductase kinase | PRKAA2
Type:
Enzyme
Mol. Mass.:
62331.02
Organism:
Homo sapiens (Human)
Description:
P54646
Residue:
552
  
Component 2
Name:
5'-AMP-activated protein kinase subunit gamma-1
Synonyms:
5'-AMP-activated protein kinase subunit gamma-1 AMP-activated protein kinase, gamma-1 subunit AMPK gamma-1 AMPK subunit gamma-1 PRKAG1
Type:
Mol. Mass.:
37581.44
Organism:
Homo sapiens (Human)
Description:
P54619
Residue:
331
  
Component 3
Name:
5'-AMP-activated protein kinase subunit beta-1
Synonyms:
5'-AMP-activated protein kinase subunit beta-1 AMP-activated protein kinase alpha-2/beta-1/gamma-3 AMPK subunit beta-1 PRKAB1
Type:
Mol. Mass.:
30380.94
Organism:
Homo sapiens (Human)
Description:
Q9Y478
Residue:
270
  
Inhibitor
Name:
BDBM50208911
Synonyms:
CHEMBL3884319
Type:
Small organic molecule
Emp. Form.:
C23H22N4O2
Mol. Mass.:
386.4464
SMILES:
CC1(C)C(=O)N([C@H]2CCc3c2cccc3O)c2nc(Nc3ccccc3)ncc12
: