Target
Myeloperoxidase
Ligand
BDBM50210143
Substrate
Meas. Tech.
ChEMBL_1634340 (CHEMBL3877132)
IC50
430±n/a nM
Citation
 Soubhye, JGelbcke, MVan Antwerpen, PDufrasne, FBoufadi, MYNève, JFurtmüller, PGObinger, CZouaoui Boudjeltia, KMeyer, F From Dynamic Combinatorial Chemistry to ACS Med Chem Lett 8:206-210 (2017)  
Target
Name:
Myeloperoxidase
Synonyms:
84 kDa myeloperoxidase MPO Myeloperoxidase Myeloperoxidase heavy chain PERM_HUMAN
Type:
Enzyme
Mol. Mass.:
83888.32
Organism:
Homo sapiens (Human)
Description:
P05164
Residue:
745
  
Inhibitor
Name:
BDBM50210143
Synonyms:
CHEMBL3885085
Type:
Small organic molecule
Emp. Form.:
C14H13N3O3
Mol. Mass.:
271.2713
SMILES:
COc1ccc(\C=N\NC(=O)c2ccncc2)cc1O
: