Target
Free fatty acid receptor 1
Ligand
BDBM50210160
Substrate
Meas. Tech.
ChEMBL_1634352 (CHEMBL3877144)
EC50
1252±n/a nM
Target
Name:
Free fatty acid receptor 1
Synonyms:
FFAR1 G-protein Coupled Receptor 40 | GPR40
Type:
G Protein-Coupled Receptor (GPCR)
Mol. Mass.:
31473.32
Organism:
Homo sapiens (Human)
Description:
O14842
Residue:
300
  
Inhibitor
Name:
BDBM50210160
Synonyms:
CHEMBL3883983
Type:
Small organic molecule
Emp. Form.:
C28H32O3
Mol. Mass.:
416.5519
SMILES:
CC1(C)CCC=C1c1cccc(c1)C1CCc2ccc(cc2O1)[C@@H](CC(O)=O)C1CC1
: