Target
Free fatty acid receptor 1
Ligand
BDBM50210154
Substrate
Meas. Tech.
ChEMBL_1634354 (CHEMBL3877146)
EC50
416±n/a nM
Target
Name:
Free fatty acid receptor 1
Synonyms:
FFAR1 G-protein Coupled Receptor 40 | GPR40
Type:
G Protein-Coupled Receptor (GPCR)
Mol. Mass.:
31473.32
Organism:
Homo sapiens (Human)
Description:
O14842
Residue:
300
  
Inhibitor
Name:
BDBM50210154
Synonyms:
CHEMBL3883504
Type:
Small organic molecule
Emp. Form.:
C29H26F4O5
Mol. Mass.:
530.5074
SMILES:
COc1ccc(F)c(c1)-c1ccc(cc1OC(F)(F)F)C1CCc2ccc(cc2O1)[C@@H](CC(O)=O)C1CC1
: