Target
Cholinesterase
Ligand
BDBM50210780
Substrate
Meas. Tech.
ChEMBL_1635126 (CHEMBL3878024)
Ki
1180±n/a nM
Citation
 Loesche, AWiese, JSommerwerk, SSimon, VBrandt, WCsuk, R Repurposing N,N'-bis-(arylamidino)-1,4-piperazinedicarboxamidines: An unexpected class of potent inhibitors of cholinesterases. Eur J Med Chem 125:430-434 (2017)  
Target
Name:
Cholinesterase
Synonyms:
BCHE CHLE_HORSE | Cholinesterase
Type:
Enzyme
Mol. Mass.:
65643.35
Organism:
Equus caballus (Horse)
Description:
P81908
Residue:
574
  
Inhibitor
Name:
BDBM50210780
Synonyms:
CHEMBL3949066
Type:
Small organic molecule
Emp. Form.:
C20H24F2N10
Mol. Mass.:
442.4684
SMILES:
Fc1ccc(NC(=N)NC(=N)N2CCN(CC2)C(=N)NC(=N)Nc2ccc(F)cc2)cc1
: