Target
Cholinesterase
Ligand
BDBM50210782
Substrate
Meas. Tech.
ChEMBL_1635127 (CHEMBL3878025)
Ki
2740±n/a nM
Citation
 Loesche, AWiese, JSommerwerk, SSimon, VBrandt, WCsuk, R Repurposing N,N'-bis-(arylamidino)-1,4-piperazinedicarboxamidines: An unexpected class of potent inhibitors of cholinesterases. Eur J Med Chem 125:430-434 (2017)  
Target
Name:
Cholinesterase
Synonyms:
BCHE CHLE_HORSE | Cholinesterase
Type:
Enzyme
Mol. Mass.:
65643.35
Organism:
Equus caballus (Horse)
Description:
P81908
Residue:
574
  
Inhibitor
Name:
BDBM50210782
Synonyms:
CHEMBL3905115
Type:
Small organic molecule
Emp. Form.:
C20H24I2N10
Mol. Mass.:
658.2805
SMILES:
Ic1ccc(NC(=N)NC(=N)N2CCN(CC2)C(=N)NC(=N)Nc2ccc(I)cc2)cc1
: