Target
Adenosine receptor A3
Ligand
BDBM50211083
Substrate
Meas. Tech.
ChEMBL_1636006 (CHEMBL3878904)
Ki
321±n/a nM
Citation
 Varano, FCatarzi, DVincenzi, FBetti, MFalsini, MRavani, ABorea, PAColotta, VVarani, K Design, Synthesis, and Pharmacological Characterization of 2-(2-Furanyl)thiazolo[5,4-d]pyrimidine-5,7-diamine Derivatives: New Highly Potent A J Med Chem 59:10564-10576 (2016)  
Target
Name:
Adenosine receptor A3
Synonyms:
A3 adenosine receptor (hA3) ADORA3 | Adenosine A3 receptor (A3AR)
Type:
G Protein-Coupled Receptor (GPCR)
Mol. Mass.:
36197.32
Organism:
Homo sapiens (Human)
Description:
P0DMS8
Residue:
318
  
Inhibitor
Name:
BDBM50211083
Synonyms:
CHEMBL3922410
Type:
Small organic molecule
Emp. Form.:
C15H11N5OS
Mol. Mass.:
309.346
SMILES:
Nc1nc(Nc2ccccc2)nc2sc(nc12)-c1ccco1
: