Target
Monoacylglycerol lipase ABHD6
Ligand
BDBM50211257
Substrate
Meas. Tech.
ChEMBL_1636272 (CHEMBL3879170)
IC50
79±n/a nM
Citation
 Deng, HKooijman, Svan den Nieuwendijk, AMOgasawara, Dvan der Wel, Tvan Dalen, FBaggelaar, MPJanssen, FJvan den Berg, RJden Dulk, HCravatt, BFOverkleeft, HSRensen, PCvan der Stelt, M Triazole Ureas Act as Diacylglycerol Lipase Inhibitors and Prevent Fasting-Induced Refeeding. J Med Chem 60:428-440 (2017)  
Target
Name:
Monoacylglycerol lipase ABHD6
Synonyms:
ABHD6_MOUSE Abhd6 Monoacylglycerol lipase ABHD6
Type:
Single-pass type II membrane protein; hydrolase
Mol. Mass.:
38216.17
Organism:
Mus musculus (mouse)
Description:
Assays were using membranes of recombinant Abh6 transiently transfected in COS-7 cells.
Residue:
336
  
Inhibitor
Name:
BDBM50211257
Synonyms:
CHEMBL3895863 | US10583137, Compound 14
Type:
Small organic molecule
Emp. Form.:
C31H28F2N4O3
Mol. Mass.:
542.5758
SMILES:
OC(c1cnn(n1)C(=O)N1C[C@@H](CC[C@@H]1Cc1ccccc1)OCC#C)(c1ccc(F)cc1)c1ccc(F)cc1
: